BDBM506429 US11045457, Example 29
SMILES CN1C[C@@H](NC(=O)C(C)(C)COc2ncccc2OC(F)(F)F)[C@@H](C1)c1cn(C)nc1C
InChI Key InChIKey=HCQKSFFXWPTXIQ-JKSUJKDBSA-N
Data  2 IC50  1 EC50
  Tab Delimited (TSV)   2D SDfile   Computed 3D by Vconf -m prep SDfile
Find this compound or compounds like it in BindingDB:
Activity Spreadsheet -- Enzyme Inhibition Constant Data from BindingDB
Found 3 hits for monomerid = 506429
TargetSomatostatin receptor type 4(Homo sapiens (Human))
Takeda Pharmaceutical
US Patent
LigandPNGBDBM506429(US11045457, Example 29)
Affinity DataEC50:  3.98nM. Assay description: This cell-based assay measures the ability of compounds to inhibit forskolin stimulated cAMP in CHO-K1 cells overexpressing SSTR4. CHO-K1 cells overe...
Ligand InfoPC cidPC sid
In DepthDetails US Patent
TargetSomatostatin receptor type 1(Homo sapiens (Human))
Takeda Pharmaceutical
US Patent
LigandPNGBDBM506429(US11045457, Example 29)
Affinity DataIC50:  398nM. Assay description: This membrane-based assay measures the ability of compounds to competitively inhibit binding of I-125 labeled somatostatin to SSTR1 in membranes from...
Ligand InfoPC cidPC sid
In DepthDetails US Patent
TargetSomatostatin receptor type 4(Homo sapiens (Human))
Takeda Pharmaceutical
US Patent
LigandPNGBDBM506429(US11045457, Example 29)
Affinity DataIC50:  39.8nM. Assay description: This membrane-based assay measures the ability of compounds to competitively inhibit binding of I-125 labeled somatostatin to SSTR4 in membranes from...
Ligand InfoPC cidPC sid
In DepthDetails US Patent