BDBM506515 US11045457, Example 115
SMILES CC[C@H]1CN(C)CC[C@@H]1NC(=O)C(C)(C)COc1ncccc1OC(F)(F)F
InChI Key InChIKey=NRAMJWSKXOKQPY-KBPBESRZSA-N
Data  2 IC50  1 EC50
  Tab Delimited (TSV)   2D SDfile   Computed 3D by Vconf -m prep SDfile
Find this compound or compounds like it in BindingDB:
Activity Spreadsheet -- Enzyme Inhibition Constant Data from BindingDB
Found 3 hits for monomerid = 506515
TargetSomatostatin receptor type 4(Homo sapiens (Human))
Takeda Pharmaceutical
US Patent
LigandPNGBDBM506515(US11045457, Example 115)
Affinity DataEC50:  0.631nM. Assay description: This cell-based assay measures the ability of compounds to inhibit forskolin stimulated cAMP in CHO-K1 cells overexpressing SSTR4. CHO-K1 cells overe...
Ligand InfoPC cidPC sid
In DepthDetails US Patent
TargetSomatostatin receptor type 1(Homo sapiens (Human))
Takeda Pharmaceutical
US Patent
LigandPNGBDBM506515(US11045457, Example 115)
Affinity DataIC50:  1.59E+3nM. Assay description: This membrane-based assay measures the ability of compounds to competitively inhibit binding of I-125 labeled somatostatin to SSTR1 in membranes from...
Ligand InfoPC cidPC sid
In DepthDetails US Patent
TargetSomatostatin receptor type 4(Homo sapiens (Human))
Takeda Pharmaceutical
US Patent
LigandPNGBDBM506515(US11045457, Example 115)
Affinity DataIC50:  5.01nM. Assay description: This membrane-based assay measures the ability of compounds to competitively inhibit binding of I-125 labeled somatostatin to SSTR4 in membranes from...
Ligand InfoPC cidPC sid
In DepthDetails US Patent