BDBM506519 US11045457, Example 119
SMILES CN1CCC(NC(=O)C(C)(C)COc2ncccc2OC(F)(F)F)C2(CC2)C1
InChI Key InChIKey=LAGZWBYENUDHAI-UHFFFAOYSA-N
Data  2 IC50  1 EC50
  Tab Delimited (TSV)   2D SDfile   Computed 3D by Vconf -m prep SDfile
Find this compound or compounds like it in BindingDB:
Activity Spreadsheet -- Enzyme Inhibition Constant Data from BindingDB
Found 3 hits for monomerid = 506519
TargetSomatostatin receptor type 4(Homo sapiens (Human))
Takeda Pharmaceutical
US Patent
LigandPNGBDBM506519(US11045457, Example 119)
Affinity DataEC50:  1nM. Assay description: This cell-based assay measures the ability of compounds to inhibit forskolin stimulated cAMP in CHO-K1 cells overexpressing SSTR4. CHO-K1 cells overe...
Ligand InfoPC cidPC sid
In DepthDetails US Patent
TargetSomatostatin receptor type 1(Homo sapiens (Human))
Takeda Pharmaceutical
US Patent
LigandPNGBDBM506519(US11045457, Example 119)
Affinity DataIC50:  1.00E+4nM. Assay description: This membrane-based assay measures the ability of compounds to competitively inhibit binding of I-125 labeled somatostatin to SSTR1 in membranes from...
Ligand InfoPC cidPC sid
In DepthDetails US Patent
TargetSomatostatin receptor type 4(Homo sapiens (Human))
Takeda Pharmaceutical
US Patent
LigandPNGBDBM506519(US11045457, Example 119)
Affinity DataIC50:  50.1nM. Assay description: This membrane-based assay measures the ability of compounds to competitively inhibit binding of I-125 labeled somatostatin to SSTR4 in membranes from...
Ligand InfoPC cidPC sid
In DepthDetails US Patent