BDBM506628 US11046649, Ex. 6
SMILES COc1ccc(cn1)-c1ccc(NC(=O)[C@@H](C)[C@@H]2[C@H]3C[C@@H](C[C@@H]23)n2cnc3cc(F)c(F)cc23)cc1
InChI Key InChIKey=HGICCDCUJMWENN-LLTJZJMNSA-N
Data  1 IC50
  Tab Delimited (TSV)   2D SDfile   Computed 3D by Vconf -m prep SDfile
Find this compound or compounds like it in BindingDB:
Activity Spreadsheet -- Enzyme Inhibition Constant Data from BindingDB
Found 1 hit for monomerid = 506628
TargetIndoleamine 2,3-dioxygenase 1(Homo sapiens (Human))
Board Of Regents, The University Of Texas System
US Patent
LigandPNGBDBM506628(US11046649, Ex. 6)
Affinity DataIC50:  329nM. Assay description: HeLa cells were obtained from the American Type Culture Collection (ATCC) and maintained in DMEM media containing 10% FBS. Cells (7,000/well) were se...
Ligand InfoPC cidPC sid
In DepthDetails US Patent