BDBM506638 N-(4-chlorophenyl)-2- ((1R,3s,5S,6r)-3-(6-cyano- 1H-benzo[d]imidazol-1-yl)- bicyclo[3.1.0]hexan-6-yl)- propanamide::US11046649, Ex. 16
SMILES CC([C@@H]1[C@H]2C[C@@H](C[C@@H]12)n1cnc2ccc(cc12)C#N)C(=O)Nc1ccc(Cl)cc1
InChI Key InChIKey=HHUNSRYGPJRAQW-REMGDRLASA-N
Data  1 IC50
  Tab Delimited (TSV)   2D SDfile   Computed 3D by Vconf -m prep SDfile
Find this compound or compounds like it in BindingDB:
Activity Spreadsheet -- Enzyme Inhibition Constant Data from BindingDB
Found 1 hit for monomerid = 506638
TargetIndoleamine 2,3-dioxygenase 1(Homo sapiens (Human))
Board Of Regents, The University Of Texas System
US Patent
LigandPNGBDBM506638(N-(4-chlorophenyl)-2- ((1R,3s,5S,6r)-3-(6-cyano- 1...)
Affinity DataIC50:  4.40nM. Assay description: HeLa cells were obtained from the American Type Culture Collection (ATCC) and maintained in DMEM media containing 10% FBS. Cells (7,000/well) were se...
Ligand InfoPC cidPC sid
In DepthDetails US Patent