BDBM506655 2-((1R,3s,5S,6r)-3-(5,6- difluoro-1H-benzo[d]- imidazol-1-yl)bicyclo- [3.1.0]hexan-6-yl)-N-(3- hydroxybicyclo[1.1.1]- pentan-1-yl)propanamide::US11046649, Ex. 33
SMILES CC([C@@H]1[C@H]2C[C@@H](C[C@@H]12)n1cnc2cc(F)c(F)cc12)C(=O)NC12CC(O)(C1)C2
InChI Key InChIKey=NQQNJXQAQLMJTL-ZHDLPETHSA-N
Data  1 IC50
  Tab Delimited (TSV)   2D SDfile   Computed 3D by Vconf -m prep SDfile
Find this compound or compounds like it in BindingDB:
Activity Spreadsheet -- Enzyme Inhibition Constant Data from BindingDB
Found 1 hit for monomerid = 506655
TargetIndoleamine 2,3-dioxygenase 1(Homo sapiens (Human))
Board Of Regents, The University Of Texas System
US Patent
LigandPNGBDBM506655(2-((1R,3s,5S,6r)-3-(5,6- difluoro-1H-benzo[d]- imi...)
Affinity DataIC50:  1.00E+4nM. Assay description: HeLa cells were obtained from the American Type Culture Collection (ATCC) and maintained in DMEM media containing 10% FBS. Cells (7,000/well) were se...
Ligand InfoPC cidPC sid
In DepthDetails US Patent