BDBM506680 N-(5-cyanopyridin-2-yl)-2- ((1R,3s,5S,6r)-3-((6- fluoroquinolin-4-yl)oxy)- bicyclo[3.1.0]hexan-6-yl)- propanamide::US11046649, Ex. 58
SMILES CC([C@@H]1[C@H]2C[C@@H](C[C@@H]12)Oc1cccc2ccc(F)cc12)C(=O)Nc1ccc(cn1)C#N
InChI Key InChIKey=HGBIFKQFAXRIEW-AUVKXVGOSA-N
Data  1 IC50
  Tab Delimited (TSV)   2D SDfile   Computed 3D by Vconf -m prep SDfile
Find this compound or compounds like it in BindingDB:
Activity Spreadsheet -- Enzyme Inhibition Constant Data from BindingDB
Found 1 hit for monomerid = 506680
TargetIndoleamine 2,3-dioxygenase 1(Homo sapiens (Human))
Board Of Regents, The University Of Texas System
US Patent
LigandPNGBDBM506680(N-(5-cyanopyridin-2-yl)-2- ((1R,3s,5S,6r)-3-((6- f...)
Affinity DataIC50:  2nM. Assay description: HeLa cells were obtained from the American Type Culture Collection (ATCC) and maintained in DMEM media containing 10% FBS. Cells (7,000/well) were se...
Ligand InfoPC cidPC sid
In DepthDetails US Patent