BDBM506802 US11046651, Compound 35
SMILES COc1ccc2Oc3ccc(Cl)cc3N=C(N3CCN(CC(C)(C)C(O)=O)CC3)c2c1
InChI Key InChIKey=UKWNTXCUILMFND-UHFFFAOYSA-N
Data  1 KI
  Tab Delimited (TSV)   2D SDfile   Computed 3D by Vconf -m prep SDfile
Find this compound or compounds like it in BindingDB:
Activity Spreadsheet -- Enzyme Inhibition Constant Data from BindingDB
Found 1 hit for monomerid = 506802
Target5-hydroxytryptamine receptor 2C(Homo sapiens (Human))
Alairion
US Patent
LigandPNGBDBM506802(US11046651, Compound 35)
Affinity DataKi:  37.5nM. Assay description: 1 μL of a compound of the present disclosure the reference compound (Table J) was transferred to an assay plate. 1 μL of 0.2 mM SB-206533 w...
Ligand InfoPC cidPC sid
In DepthDetails US Patent