BDBM506808 US11046652, Example 1-2::US11046652, Example 1-3
SMILES CO[C@H](CC(=O)NO)[C@H](Cc1ccc(Cl)cc1)c1ccnn1C
InChI Key InChIKey=RXROQRMQHOWZAT-UKRRQHHQSA-N
Data  2 KI
  Tab Delimited (TSV)   2D SDfile   Computed 3D by Vconf -m prep SDfile
Find this compound or compounds like it in BindingDB:
Activity Spreadsheet -- Enzyme Inhibition Constant Data from BindingDB
Found 2 hits for monomerid = 506808
TargetBotulinum neurotoxin type A [1-429](Clostridium botulinum (strain Hall / ATCC 3502 / N...)
Hawaii Biotech
US Patent
LigandPNGBDBM506808(US11046652, Example 1-2 | US11046652, Example 1-3)
Affinity DataKi:  6.40nM. Assay description: In a 96 well, clear bottom black plate, the following was added to each well: 5 nM BoNT/A LC1-429, 28 μM substrate in 30 mM HEPES pH 7.3, 0.05 m...
Ligand InfoPC cidPC sid
In DepthDetails US Patent
TargetBotulinum neurotoxin type A [1-429](Clostridium botulinum (strain Hall / ATCC 3502 / N...)
Hawaii Biotech
US Patent
LigandPNGBDBM506808(US11046652, Example 1-2 | US11046652, Example 1-3)
Affinity DataKi:  21.3nM. Assay description: In a 96 well, clear bottom black plate, the following was added to each well: 5 nM BoNT/A LC1-429, 28 μM substrate in 30 mM HEPES pH 7.3, 0.05 m...
Ligand InfoPC cidPC sid
In DepthDetails US Patent