BDBM506863 3-amino-6-(5-(3-amino- 1,1,1-trifluoro-2-hydroxy- 3-oxopropan-2-yl)-2- methylphenyl)-N-((1r,4r)- 4-hydroxy-4- (trifluoromethyl) cyclohexyl)pyrazine- 2-carboxamide trifluoroacetate::US11046658, Example 18
SMILES Cc1ccc(cc1-c1cnc(N)c(n1)C(=O)N[C@H]1CC[C@](O)(CC1)C(F)(F)F)C(O)(C(N)=O)C(F)(F)F
InChI Key InChIKey=DGPIRWITQSIDCP-IOCRRLERSA-N
Data  2 IC50
  Tab Delimited (TSV)   2D SDfile   Computed 3D by Vconf -m prep SDfile
Find this compound or compounds like it in BindingDB:
Activity Spreadsheet -- Enzyme Inhibition Constant Data from BindingDB
Found 2 hits for monomerid = 506863
LigandPNGBDBM506863(3-amino-6-(5-(3-amino- 1,1,1-trifluoro-2-hydroxy- ...)
Affinity DataIC50: <100nM. Assay description: Materials: [γ-33P]ATP (10 mCi/mL) and Wheat Germ Agglutinin (WGA) YSi SPA Scintillation Beads was purchased from Perkin Elmer (Waltham, Mass.). ...
Ligand InfoPC cidPC sid
In DepthDetails US Patent
LigandPNGBDBM506863(3-amino-6-(5-(3-amino- 1,1,1-trifluoro-2-hydroxy- ...)
Affinity DataIC50: <100nM. Assay description: Materials: [γ-33P]ATP (10 mCi/mL) and Wheat Germ Agglutinin (WGA) YSi SPA Scintillation Beads was purchased from Perkin Elmer (Waltham, Mass.). ...
Ligand InfoPC cidPC sid
In DepthDetails US Patent