BDBM506993 1-[4-hydroxy-2-(1-methyl-1H- imidazol-5-yl)-1,3-thiazol-5- yl]propan-1-one::US11046662, Compound 18
SMILES CCC(=O)c1sc(nc1O)-c1cncn1C
InChI Key InChIKey=BLJIOPWQZPDBMN-UHFFFAOYSA-N
Data  1 IC50
  Tab Delimited (TSV)   2D SDfile   Computed 3D by Vconf -m prep SDfile
Find this compound or compounds like it in BindingDB:
Activity Spreadsheet -- Enzyme Inhibition Constant Data from BindingDB
Found 1 hit for monomerid = 506993
TargetTransient receptor potential cation channel subfamily M member 8(Homo sapiens (Human))
DompÉ
US Patent
LigandPNGBDBM506993(1-[4-hydroxy-2-(1-methyl-1H- imidazol-5-yl)-1,3-th...)
Affinity DataIC50:  112nM
Ligand InfoPC cidPC sid
In DepthDetails US Patent