BDBM507011 1-[2-(4-fluorophenyl)-4-hydroxy-1,3- thiazol-5-yl]propan-1-one::US11046662, Compound 36
SMILES CCC(=O)c1sc(nc1O)-c1ccc(F)cc1
InChI Key InChIKey=HQLMURRZORBDJQ-UHFFFAOYSA-N
Data  1 IC50
  Tab Delimited (TSV)   2D SDfile   Computed 3D by Vconf -m prep SDfile
Find this compound or compounds like it in BindingDB:
Activity Spreadsheet -- Enzyme Inhibition Constant Data from BindingDB
Found 1 hit for monomerid = 507011
TargetTransient receptor potential cation channel subfamily M member 8(Homo sapiens (Human))
DompÉ
US Patent
LigandPNGBDBM507011(1-[2-(4-fluorophenyl)-4-hydroxy-1,3- thiazol-5-yl]...)
Affinity DataIC50:  50nM
Ligand InfoPC cidPC sid
In DepthDetails US Patent