BDBM507029 US11046670, Compound 41
SMILES CN1CC[C@@H]2C[C@@H]1c1cc(ccc21)-c1ccc(cc1)C(F)(F)F
InChI Key InChIKey=VQJOLAVGGLHBJE-RDTXWAMCSA-N
Data  2 KI
  Tab Delimited (TSV)   2D SDfile   Computed 3D by Vconf -m prep SDfile
Find this compound or compounds like it in BindingDB:
Activity Spreadsheet -- Enzyme Inhibition Constant Data from BindingDB
Found 2 hits for monomerid = 507029
TargetSigma intracellular receptor 2(Homo sapiens (Human))
Board Of Regents, The University Of Texas System
US Patent
LigandPNGBDBM507029(US11046670, Compound 41)
Affinity DataKi:  43nM
Ligand InfoPC cidPC sid
In DepthDetails US Patent
TargetSigma non-opioid intracellular receptor 1(Homo sapiens (Human))
Board Of Regents, The University Of Texas System
US Patent
LigandPNGBDBM507029(US11046670, Compound 41)
Affinity DataKi:  156nM. Assay description: Receptor binding assays were performed by the Psychoactive Drug Screening Program (PDSP) at Chapel Hill, N.C. The assay protocol book can be accessed...
Ligand InfoPC cidPC sid
In DepthDetails US Patent