BDBM507161 US11046681, Example 2::tert-butyl (3R,4R)-4-[4-hydroxy-4-[(4-oxothieno[2,3-d]pyrimidin-3-yl)methyl]piperidine-1-carbonyl]-3-phenyl-piperidine-1-carboxylate
SMILES CC(C)(C)OC(=O)N1CC[C@H]([C@@H](C1)c1ccccc1)C(=O)N1CCC(Cn2cnc3sccc3c2=O)CC1
InChI Key InChIKey=CFECZKGTSHAFTF-VWNXMTODSA-N
Data  1 IC50
  Tab Delimited (TSV)   2D SDfile   Computed 3D by Vconf -m prep SDfile
Find this compound or compounds like it in BindingDB:
Activity Spreadsheet -- Enzyme Inhibition Constant Data from BindingDB
Found 1 hit for monomerid = 507161
TargetUbiquitin carboxyl-terminal hydrolase 7(Homo sapiens (Human))
Les Laboratoires Servier
US Patent
LigandPNGBDBM507161(US11046681, Example 2 | tert-butyl (3R,4R)-4-[4-hy...)
Affinity DataIC50:  128nM. Assay description: USP7 activity was measured using Rhodamine-110 c-terminal labelled Ubiquitin as a substrate (Viva Biosciences). Incubation with USP7 results in the r...
Ligand InfoPC cidPC sid
In DepthDetails US Patent