BDBM507616 US11046681, Example 40::tert-butyl (3R,4R)-4-[4-hydroxy-4-[[7-(4-methoxyphenyl)-4-oxo-pyrrolo[2,3-d]pyrimidin-3-yl]methyl]piperidine-1-carbonyl]-3-phenyl-piperidine-1-carboxylate
SMILES COc1ccc(cc1)-n1ccc2c1ncn(CC1CCN(CC1)C(=O)[C@@H]1CCN(C[C@H]1c1ccccc1)C(=O)OC(C)(C)C)c2=O
InChI Key InChIKey=MHFCHLXHJOOTFC-VEEOACQBSA-N
Data  1 IC50
  Tab Delimited (TSV)   2D SDfile   Computed 3D by Vconf -m prep SDfile
Find this compound or compounds like it in BindingDB:
Activity Spreadsheet -- Enzyme Inhibition Constant Data from BindingDB
Found 1 hit for monomerid = 507616
TargetUbiquitin carboxyl-terminal hydrolase 7(Homo sapiens (Human))
Les Laboratoires Servier
US Patent
LigandPNGBDBM507616(US11046681, Example 40 | tert-butyl (3R,4R)-4-[4-h...)
Affinity DataIC50:  49.9nM. Assay description: USP7 activity was measured using Rhodamine-110 c-terminal labelled Ubiquitin as a substrate (Viva Biosciences). Incubation with USP7 results in the r...
Ligand InfoPC cidPC sid
In DepthDetails US Patent