BDBM507626 3-[[4-hydroxy-1-[(3R,4R)-3-phenylpiperidine-4-carbonyl]-4-piperidyl]methyl]-7-(4-methoxyphenyl)pyrrolo[2,3-d]pyrimidin-4-one::US11046681, Example 135
SMILES COc1ccc(cc1)-n1ccc2c1ncn(CC1(O)CCN(CC1)C(=O)[C@@H]1CCNC[C@H]1c1ccccc1)c2=O
InChI Key InChIKey=RBLAHBIYRKJXLL-VPUSJEBWSA-N
Data  1 IC50
  Tab Delimited (TSV)   2D SDfile   Computed 3D by Vconf -m prep SDfile
Find this compound or compounds like it in BindingDB:
Activity Spreadsheet -- Enzyme Inhibition Constant Data from BindingDB
Found 1 hit for monomerid = 507626
TargetUbiquitin carboxyl-terminal hydrolase 7(Homo sapiens (Human))
Les Laboratoires Servier
US Patent
LigandPNGBDBM507626(3-[[4-hydroxy-1-[(3R,4R)-3-phenylpiperidine-4-carb...)
Affinity DataIC50:  28.7nM. Assay description: USP7 activity was measured using Rhodamine-110 c-terminal labelled Ubiquitin as a substrate (Viva Biosciences). Incubation with USP7 results in the r...
Ligand InfoPC cidPC sid
In DepthDetails US Patent