BDBM50763 2,3-Dihydro-benzo[1,4]dioxine-6-carboxylic acid (3-imidazol-1-yl-propyl)-amide::MLS000074975::N-(3-imidazol-1-ylpropyl)-2,3-dihydro-1,4-benzodioxin-6-carboxamide::N-(3-imidazol-1-ylpropyl)-2,3-dihydro-1,4-benzodioxine-6-carboxamide::N-[3-(1-imidazolyl)propyl]-2,3-dihydro-1,4-benzodioxin-6-carboxamide::SMR000014389::cid_652033
SMILES O=C(NCCCn1ccnc1)c1ccc2OCCOc2c1
InChI Key InChIKey=MSXXZWIHLNNASC-UHFFFAOYSA-N
Data  1 IC50
  Tab Delimited (TSV)   2D SDfile   Computed 3D by Vconf -m prep SDfile
Find this compound or compounds like it in BindingDB:
Activity Spreadsheet -- Enzyme Inhibition Constant Data from BindingDB
Found 1 hit for monomerid = 50763
TargetGlycoprotein 42(Human herpesvirus 4 type 2)
Emory University
Curated by PubChem BioAssay
LigandPNGBDBM50763(2,3-Dihydro-benzo[1,4]dioxine-6-carboxylic acid (3...)
Affinity DataIC50:  420nM. Assay description: NIH Molecular Libraries Screening Centers Network [MLSCN] Emory Chemical Biology Discovery Center in MLSCN Assay provider: Theodore Jardetzky; Northw...
In DepthDetails PCBioAssay