BDBM507652 US11046682, Compound 17
SMILES O=C(Nc1ccc(cc1)C#N)Nc1c(ccc2cncn12)-c1ccccc1
InChI Key InChIKey=SRMCTJYVQMFBRK-UHFFFAOYSA-N
Data  1 IC50
  Tab Delimited (TSV)   2D SDfile   Computed 3D by Vconf -m prep SDfile
Find this compound or compounds like it in BindingDB:
Activity Spreadsheet -- Enzyme Inhibition Constant Data from BindingDB
Found 1 hit for monomerid = 507652
TargetIndoleamine 2,3-dioxygenase 1(Homo sapiens (Human))
Beijing Innocare Pharma Tech
US Patent
LigandPNGBDBM507652(US11046682, Compound 17)
Affinity DataIC50: <250nM. Assay description: The effects of the compounds of the invention on the activity of indoleamine 2,3-dioxygenase (IDO) were evaluated by the Ehrlich method.The experimen...
Ligand InfoPC cidPC sid
In DepthDetails US Patent