BDBM507671 US11046682, Compound 45
SMILES ON(C(=O)Cc1c(ccc2cncn12)-c1ccccc1)c1ccc(cc1)C#N
InChI Key InChIKey=GUCZPXQPYQZTGY-UHFFFAOYSA-N
Data  1 IC50
  Tab Delimited (TSV)   2D SDfile   Computed 3D by Vconf -m prep SDfile
Find this compound or compounds like it in BindingDB:
Activity Spreadsheet -- Enzyme Inhibition Constant Data from BindingDB
Found 1 hit for monomerid = 507671
TargetIndoleamine 2,3-dioxygenase 1(Homo sapiens (Human))
Beijing Innocare Pharma Tech
US Patent
LigandPNGBDBM507671(US11046682, Compound 45)
Affinity DataIC50: <250nM. Assay description: The effects of the compounds of the invention on the activity of indoleamine 2,3-dioxygenase (IDO) were evaluated by the Ehrlich method.The experimen...
Ligand InfoPC cidPC sid
In DepthDetails US Patent