BDBM507688 N-((1r,4r)-4-(5-(6-(3- cyanopyrrolo[1,2- b]pyridazin-7-yl)-4-((3- methyloxetan-3- yl)amino)pyridin-3-yl)- 1,3,4-thiadiazol-2- yl)cyclohexyl)acetamide::US11046686, Example 3
SMILES CC(=O)NC1CC[C@@H](CC1)c1nnc(s1)-c1cnc(cc1NC1(C)COC1)-c1ccc2cc(cnn12)C#N
InChI Key InChIKey=VZJXBJKRFMHFIC-NZANSXMDSA-N
Data  1 IC50
  Tab Delimited (TSV)   2D SDfile   Computed 3D by Vconf -m prep SDfile
Find this compound or compounds like it in BindingDB:
Activity Spreadsheet -- Enzyme Inhibition Constant Data from BindingDB
Found 1 hit for monomerid = 507688
TargetInterleukin-1 receptor-associated kinase 4(Homo sapiens (Human))
Gilead Sciences
US Patent
LigandPNGBDBM507688(N-((1r,4r)-4-(5-(6-(3- cyanopyrrolo[1,2- b]pyridaz...)
Affinity DataIC50: <1nM. Assay description: IRAK4 enzyme (Carna Biosciences, Chuo-ku, Kobe, Japan) activity was measured by detecting phosphorylated peptide substrate formation using an antibod...
Ligand InfoPC cidPC sid
In DepthDetails US Patent