BDBM507749 7-chloro-4-(methylamino)-1-(thiazol-2- yl)-quinazolin-2(1H)-one::US11046691, Compound 17::US11084798, Cpd No 17::US11130759, Cpd. No. 17
SMILES CNc1nc(=O)n(-c2nccs2)c2cc(Cl)ccc12
InChI Key InChIKey=CDGTUASBLVPTSY-UHFFFAOYSA-N
Data  3 IC50
  Tab Delimited (TSV)   2D SDfile   Computed 3D by Vconf -m prep SDfile
Find this compound or compounds like it in BindingDB:
Activity Spreadsheet -- Enzyme Inhibition Constant Data from BindingDB
Found 3 hits for monomerid = 507749
TargetS-adenosylmethionine synthase isoform type-2(Human)
Ideaya Biosciences
US Patent
LigandPNGBDBM507749(7-chloro-4-(methylamino)-1-(thiazol-2- yl)-quinazo...)
Affinity DataIC50: <200nM. Assay description: Materials:Enzyme: MAT2AhMAT2A: 50 nM, Cepter, 10 mg/mL (234 μM), amino acids 1-395Substrates: 500 uM eachReaction time: 1 hourL-methionine Subst...
Ligand InfoPC cidPC sid
In DepthDetails US Patent
TargetS-adenosylmethionine synthase isoform type-2(Human)
Ideaya Biosciences
US Patent
LigandPNGBDBM507749(7-chloro-4-(methylamino)-1-(thiazol-2- yl)-quinazo...)
Affinity DataIC50: <200nM. Assay description: Enzyme: MAT2AhMAT2A: 50 nM, Cepter, 10 mg/mL (234 μM), amino acids 1-395Substrates: 500 uM eachReaction time: 1 hourL-methionine Substrate: Alfa...
Ligand InfoPC cidPC sid
In DepthDetails US Patent
TargetS-adenosylmethionine synthase isoform type-2(Human)
Ideaya Biosciences
US Patent
LigandPNGBDBM507749(7-chloro-4-(methylamino)-1-(thiazol-2- yl)-quinazo...)
Affinity DataIC50: <200nM. Assay description: 5 μL of 3× final concentration test compounds in DMSO or DMSO were transferred to the appropriate wells of a microtiter plate and the plate was ...
Ligand InfoPC cidPC sid
In DepthDetails US Patent