BDBM507787 7-chloro-4-[methylbenzylamino]-1- phenylhydroquinazolin-2-one::US11046691, Compound 197::US11084798, Cpd No 197::US11130759, Cpd. No. 197
SMILES CN(Cc1ccccc1)c1nc(=O)n(-c2ccccc2)c2cc(Cl)ccc12
InChI Key InChIKey=PAEYAOVIVDMVSC-UHFFFAOYSA-N
Data  3 IC50
  Tab Delimited (TSV)   2D SDfile   Computed 3D by Vconf -m prep SDfile
Find this compound or compounds like it in BindingDB:
Activity Spreadsheet -- Enzyme Inhibition Constant Data from BindingDB
Found 3 hits for monomerid = 507787
TargetS-adenosylmethionine synthase isoform type-2(Human)
Ideaya Biosciences
US Patent
LigandPNGBDBM507787(7-chloro-4-[methylbenzylamino]-1- phenylhydroquina...)
Affinity DataIC50: <200nM. Assay description: MAT2A enzyme is incubated with a test compound in DMSO or DMSO and its substrates (L-methionine and ATP) in a microtiter plate. The enzymatic reactio...
Ligand InfoPC cidPC sid
In DepthDetails US Patent
TargetS-adenosylmethionine synthase isoform type-2(Human)
Ideaya Biosciences
US Patent
LigandPNGBDBM507787(7-chloro-4-[methylbenzylamino]-1- phenylhydroquina...)
Affinity DataIC50: <200nM. Assay description: Enzyme: MAT2AhMAT2A: 50 nM, Cepter, 10 mg/mL (234 μM), amino acids 1-395Substrates: 500 uM eachReaction time: 1 hourL-methionine Substrate: Alfa...
Ligand InfoPC cidPC sid
In DepthDetails US Patent
TargetS-adenosylmethionine synthase isoform type-2(Human)
Ideaya Biosciences
US Patent
LigandPNGBDBM507787(7-chloro-4-[methylbenzylamino]-1- phenylhydroquina...)
Affinity DataIC50: <200nM. Assay description: For the assay, a mixture of 1 mM L-methionine/1 mM ATP (2× final pre-stopped concentration) in assay buffer; MAT2A (2× final pre-stopped concentratio...
Ligand InfoPC cidPC sid
In DepthDetails US Patent