BDBM508522 US11046714, Example 5
SMILES Nc1nc2c3OC(F)(F)Oc3ccc2c2nc(Cc3cccnc3N3CC[C@H](C3)c3ccc(cc3)C(F)(F)F)nn12
InChI Key InChIKey=SJUQCZFCOZFYFA-MRXNPFEDSA-N
Data  1 KI
  Tab Delimited (TSV)   2D SDfile   Computed 3D by Vconf -m prep SDfile
Find this compound or compounds like it in BindingDB:
Activity Spreadsheet -- Enzyme Inhibition Constant Data from BindingDB
Found 1 hit for monomerid = 508522
TargetAdenosine receptor A2a(Homo sapiens (Human))
Merck Sharp & Dohme
US Patent
LigandPNGBDBM508522(US11046714, Example 5)
Affinity DataKi:  15nM. Assay description: The following table shows representative data for the compounds of the Examples as A2a receptor antagonists as determined by a competition binding as...
Ligand InfoPC cidPC sid
In DepthDetails US Patent