BDBM508537 8-[2-(2-cyclopropyl-6,7- dihydro[1,3]oxazolo[5,4- c]pyridin-5(4H)-yl)ethyl]-2,2- difluoro[1,3]dioxolo[4,5- h][1,2,4]triazolo[1,5- c]quinazolin-5-amine::US11046714, Example 14
SMILES Nc1nc2c3OC(F)(F)Oc3ccc2c2nc(CCN3CCc4nc(oc4C3)C3CC3)nn12
InChI Key InChIKey=QWJPZYIOHDOSNN-UHFFFAOYSA-N
Data  1 KI
  Tab Delimited (TSV)   2D SDfile   Computed 3D by Vconf -m prep SDfile
Find this compound or compounds like it in BindingDB:
Activity Spreadsheet -- Enzyme Inhibition Constant Data from BindingDB
Found 1 hit for monomerid = 508537
TargetAdenosine receptor A2a(Homo sapiens (Human))
Merck Sharp & Dohme
US Patent
LigandPNGBDBM508537(8-[2-(2-cyclopropyl-6,7- dihydro[1,3]oxazolo[5,4- ...)
Affinity DataKi:  0.900nM. Assay description: The following table shows representative data for the compounds of the Examples as A2a receptor antagonists as determined by a competition binding as...
Ligand InfoPC cidPC sid
In DepthDetails US Patent