BDBM508569 8-[2-(3,3-dimethylpiperidin-1- yl)ethyl]-2,2-difluoro[1,3] dioxolo[4,5-h][1,2,4]triazolo [1,5-c]quinazolin-5-amine::US11046714, Example 39
SMILES CC1(C)CCCN(CCc2nc3c4ccc5OC(F)(F)Oc5c4nc(N)n3n2)C1
InChI Key InChIKey=VOPXKJKORUYYPS-UHFFFAOYSA-N
Data  1 KI
  Tab Delimited (TSV)   2D SDfile   Computed 3D by Vconf -m prep SDfile
Find this compound or compounds like it in BindingDB:
Activity Spreadsheet -- Enzyme Inhibition Constant Data from BindingDB
Found 1 hit for monomerid = 508569
TargetAdenosine receptor A2a(Homo sapiens (Human))
Merck Sharp & Dohme
US Patent
LigandPNGBDBM508569(8-[2-(3,3-dimethylpiperidin-1- yl)ethyl]-2,2-diflu...)
Affinity DataKi:  67nM. Assay description: The following table shows representative data for the compounds of the Examples as A2a receptor antagonists as determined by a competition binding as...
Ligand InfoPC cidPC sid
In DepthDetails US Patent