BDBM508575 2,2-difluoro-8-{2-[(3S)-3- methylmorpholin-4- yl]ethyl}[1,3]dioxolo[4,5- h][1,2,4]triazolo[1,5- c]quinazolin-5-amine::US11046714, Example 43
SMILES C[C@H]1COCCN1CCc1nc2c3ccc4OC(F)(F)Oc4c3nc(N)n2n1
InChI Key InChIKey=RBRWXJDRARDMOH-VIFPVBQESA-N
Data  1 KI
  Tab Delimited (TSV)   2D SDfile   Computed 3D by Vconf -m prep SDfile
Find this compound or compounds like it in BindingDB:
Activity Spreadsheet -- Enzyme Inhibition Constant Data from BindingDB
Found 1 hit for monomerid = 508575
TargetAdenosine receptor A2a(Homo sapiens (Human))
Merck Sharp & Dohme
US Patent
LigandPNGBDBM508575(2,2-difluoro-8-{2-[(3S)-3- methylmorpholin-4- yl]e...)
Affinity DataKi:  7.80nM. Assay description: The following table shows representative data for the compounds of the Examples as A2a receptor antagonists as determined by a competition binding as...
Ligand InfoPC cidPC sid
In DepthDetails US Patent