BDBM508606 8-[2-(1,8-diazaspiro[4.5]dec-1- yl)ethyl]-2,2-difluoro[1,3] dioxolo[4,5-h][1,2,4]triazolo [1,5-c]quinazolin-5-amine::US11046714, Example 55
SMILES Nc1nc2c3OC(F)(F)Oc3ccc2c2nc(CCN3CCCC33CCNCC3)nn12
InChI Key InChIKey=IQHDICWJHSHNEV-UHFFFAOYSA-N
Data  1 KI
  Tab Delimited (TSV)   2D SDfile   Computed 3D by Vconf -m prep SDfile
Find this compound or compounds like it in BindingDB:
Activity Spreadsheet -- Enzyme Inhibition Constant Data from BindingDB
Found 1 hit for monomerid = 508606
TargetAdenosine receptor A2a(Homo sapiens (Human))
Merck Sharp & Dohme
US Patent
LigandPNGBDBM508606(8-[2-(1,8-diazaspiro[4.5]dec-1- yl)ethyl]-2,2-difl...)
Affinity DataKi:  22nM. Assay description: The following table shows representative data for the compounds of the Examples as A2a receptor antagonists as determined by a competition binding as...
Ligand InfoPC cidPC sid
In DepthDetails US Patent