BDBM508624 US11046712, No 104
SMILES C[C@@H](N1CCN(CC1)c1ncc(cn1)C(F)(F)F)c1ccc2nccnc2c1
InChI Key InChIKey=JQJHLPSGRSSZQC-CYBMUJFWSA-N
Data  1 IC50
  Tab Delimited (TSV)   2D SDfile   Computed 3D by Vconf -m prep SDfile
Find this compound or compounds like it in BindingDB:
Activity Spreadsheet -- Enzyme Inhibition Constant Data from BindingDB
Found 1 hit for monomerid = 508624
TargetProtein O-GlcNAcase(Homo sapiens (Human))
Asceneuron
US Patent
LigandPNGBDBM508624(US11046712, No 104)
Affinity DataIC50:  125nM. Assay description: 5 μI of the appropriate concentration of a solution of inhibitor in McIlvaine's Buffer (pH 6.5) in 2% DMSO (for a dose response curve calcul...
Ligand InfoPC cidPC sid
In DepthDetails US Patent