BDBM508659 US11046714, Example 97::US11046714, Example 98
SMILES Nc1nc2c3OC(F)(F)Oc3ccc2c2nc(CC(C(F)F)N3Cc4cccnc4C3)nn12
InChI Key InChIKey=VYZOSYUGOLJDKX-UHFFFAOYSA-N
Data  2 KI
  Tab Delimited (TSV)   2D SDfile   Computed 3D by Vconf -m prep SDfile
Find this compound or compounds like it in BindingDB:
Activity Spreadsheet -- Enzyme Inhibition Constant Data from BindingDB
Found 2 hits for monomerid = 508659
TargetAdenosine receptor A2a(Homo sapiens (Human))
Merck Sharp & Dohme
US Patent
LigandPNGBDBM508659(US11046714, Example 97 | US11046714, Example 98)
Affinity DataKi:  2.20nM. Assay description: The following table shows representative data for the compounds of the Examples as A2a receptor antagonists as determined by a competition binding as...
Ligand InfoPC cidPC sid
In DepthDetails US Patent
TargetAdenosine receptor A2a(Homo sapiens (Human))
Merck Sharp & Dohme
US Patent
LigandPNGBDBM508659(US11046714, Example 97 | US11046714, Example 98)
Affinity DataKi:  6.60nM. Assay description: The following table shows representative data for the compounds of the Examples as A2a receptor antagonists as determined by a competition binding as...
Ligand InfoPC cidPC sid
In DepthDetails US Patent