BDBM508661 US11046714, Example 99
SMILES Nc1nc2c3OC(F)(F)Oc3ccc2c2nc(CCn3cccn3)nn12
InChI Key InChIKey=ICULLZMXRXWBII-UHFFFAOYSA-N
Data  1 KI
  Tab Delimited (TSV)   2D SDfile   Computed 3D by Vconf -m prep SDfile
Find this compound or compounds like it in BindingDB:
Activity Spreadsheet -- Enzyme Inhibition Constant Data from BindingDB
Found 1 hit for monomerid = 508661
TargetAdenosine receptor A2a(Homo sapiens (Human))
Merck Sharp & Dohme
US Patent
LigandPNGBDBM508661(US11046714, Example 99)
Affinity DataKi:  2.70nM. Assay description: The following table shows representative data for the compounds of the Examples as A2a receptor antagonists as determined by a competition binding as...
Ligand InfoPC cidPC sid
In DepthDetails US Patent