BDBM508678 2,2-difluoro-8-{[3-fluoro-3- (trifluoromethyl)azetidin-1-yl]methyl} [1,3]dioxolo[4,5-h][1,2,4]triazolo[1,5- c]quinazolin-5-amine::US11046714, Example 114
SMILES Nc1nc2c3OC(F)(F)Oc3ccc2c2nc(CN3CC(F)(C3)C(F)(F)F)nn12
InChI Key InChIKey=NIIYEBSTWURKMK-UHFFFAOYSA-N
Data  1 KI
  Tab Delimited (TSV)   2D SDfile   Computed 3D by Vconf -m prep SDfile
Find this compound or compounds like it in BindingDB:
Activity Spreadsheet -- Enzyme Inhibition Constant Data from BindingDB
Found 1 hit for monomerid = 508678
TargetAdenosine receptor A2a(Homo sapiens (Human))
Merck Sharp & Dohme
US Patent
LigandPNGBDBM508678(2,2-difluoro-8-{[3-fluoro-3- (trifluoromethyl)azet...)
Affinity DataKi:  1.40nM. Assay description: The following table shows representative data for the compounds of the Examples as A2a receptor antagonists as determined by a competition binding as...
Ligand InfoPC cidPC sid
In DepthDetails US Patent