BDBM508686 8-[(3-ethyl-5,6-dihydro[1,2,4]triazolo [4,3-a]pyrazin-7(8H)-yl)methyl]-2,2- difluoro[1,3]dioxolo[4,5-h][1,2,4] triazolo[1,5-c]quinazolin-5-amine::US11046714, Example 122
SMILES CCc1nnc2CN(Cc3nc4c5ccc6OC(F)(F)Oc6c5nc(N)n4n3)CCn12
InChI Key InChIKey=AHYOFXKEUHGSGN-UHFFFAOYSA-N
Data  1 KI
  Tab Delimited (TSV)   2D SDfile   Computed 3D by Vconf -m prep SDfile
Find this compound or compounds like it in BindingDB:
Activity Spreadsheet -- Enzyme Inhibition Constant Data from BindingDB
Found 1 hit for monomerid = 508686
TargetAdenosine receptor A2a(Homo sapiens (Human))
Merck Sharp & Dohme
US Patent
LigandPNGBDBM508686(8-[(3-ethyl-5,6-dihydro[1,2,4]triazolo [4,3-a]pyra...)
Affinity DataKi:  110nM. Assay description: The following table shows representative data for the compounds of the Examples as A2a receptor antagonists as determined by a competition binding as...
Ligand InfoPC cidPC sid
In DepthDetails US Patent