BDBM509978 Jun9-51-3
SMILES C[C@H](NC(=O)C(N(C(=O)C=C)c1ccc(cc1)-c1ccccc1)c1cccnc1)c1ccccc1
InChI Key InChIKey=HCNIOVAEECJZKZ-RBQQCVMASA-N
Data  1 IC50
  Tab Delimited (TSV)   2D SDfile   Computed 3D by Vconf -m prep SDfile
Find this compound or compounds like it in BindingDB:
Activity Spreadsheet -- Enzyme Inhibition Constant Data from BindingDB
Found 1 hit for monomerid = 509978
TargetReplicase polyprotein 1ab(2019-nCoV)
The University Of Arizona
LigandPNGBDBM509978(Jun9-51-3)
Affinity DataIC50: >2.00E+4nM. Assay description: FRET-based enzymatic assay.
Ligand InfoPC cidPC sid
In DepthDetails ArticlePubMed