BDBM509983 Jun9-57-3R
SMILES C[C@H](NC(=O)[C@H](N(C(=O)CCl)c1ccc(cc1)-c1ccccc1)c1cnccn1)c1ccccc1
InChI Key InChIKey=XOAGWSZAHKTMRK-CCLHPLFOSA-N
Data  1 IC50
  Tab Delimited (TSV)   2D SDfile   Computed 3D by Vconf -m prep SDfile
Find this compound or compounds like it in BindingDB:
Activity Spreadsheet -- Enzyme Inhibition Constant Data from BindingDB
Found 1 hit for monomerid = 509983
TargetReplicase polyprotein 1ab(2019-nCoV)
The University Of Arizona
LigandPNGBDBM509983(Jun9-57-3R)
Affinity DataIC50:  50nM. Assay description: FRET-based enzymatic assay.
Ligand InfoPC cidPC sid
In DepthDetails ArticlePubMed