BDBM510000 Jun9-72-4
SMILES C[C@H](NC(=O)C(N(C(=O)C(Cl)(Cl)Cl)c1ccc(cc1)-c1ccccc1)c1cccnc1)c1ccccc1
InChI Key InChIKey=BSGMAMSQWHDWTP-DQUNLGLBSA-N
Data  1 IC50
  Tab Delimited (TSV)   2D SDfile   Computed 3D by Vconf -m prep SDfile
Find this compound or compounds like it in BindingDB:
Activity Spreadsheet -- Enzyme Inhibition Constant Data from BindingDB
Found 1 hit for monomerid = 510000
TargetReplicase polyprotein 1ab(2019-nCoV)
The University Of Arizona
LigandPNGBDBM510000(Jun9-72-4)
Affinity DataIC50: >2.00E+4nM. Assay description: FRET-based enzymatic assay.
Ligand InfoPC cidPC sid
In DepthDetails ArticlePubMed