BDBM510034 (3S)-3-({N-[(4-methoxy-1 H-indol-2-yl)carbonyl]-L-leucyl}amino)-2-oxo-4-[(3S)-2-oxopyrrolidin-3-yl]butyl 2-[(dimethylamino)methyl]benzoate::WO2021205290, Example 53
SMILES COc1cccc2[nH]c(cc12)C(=O)N[C@@H](CC(C)C)C(=O)N[C@@H](C[C@@H]1CCNC1=O)C(=O)COC(=O)Cc1ccccc1CN(C)C
InChI Key
Data  1 IC50  1 EC50
  Tab Delimited (TSV)   2D SDfile   Computed 3D by Vconf -m prep SDfile
Find this compound or compounds like it in BindingDB:
Activity Spreadsheet -- Enzyme Inhibition Constant Data from BindingDB
Found 2 hits for monomerid = 510034
TargetReplicase polyprotein 1ab(2019-nCoV)
Pfizer
WIPO
LigandPNGBDBM510034((3S)-3-({N-[(4-methoxy-1 H-indol-2-yl)carbonyl]-L-...)
Affinity DataEC50:  538nM. Assay description: The ability of compounds to prevent SARS-CoV-2 coronavirus-induced cell death or cytopathic effect can be assessed via cell viability, using an assay...
Ligand InfoPC cidPC sid
In DepthDetails PubMed
TargetReplicase polyprotein 1ab(2019-nCoV)
Pfizer
WIPO
LigandPNGBDBM510034((3S)-3-({N-[(4-methoxy-1 H-indol-2-yl)carbonyl]-L-...)
Affinity DataIC50:  14nM. Assay description: Proteolytic activity of SARS-CoV-2 Coronavirus 3CL protease is measured using a continuous fluorescence resonance energy transfer assay. The SARS-CoV...
Ligand InfoPC cidPC sid
In DepthDetails PubMed