BDBM510044 (3S)-3-({N-[(4-methoxy-1H-indol-2-yl)carbonyl]-L-leucyl}amino)-2-oxo-4-[(3S)-2-oxopyrrolidin-3-yl]butyl 2-fluoro-6-methylbenzoate::WO2021205290, Example 72
SMILES COc1cccc2[nH]c(cc12)C(=O)N[C@@H](CC(C)C)C(=O)N[C@@H](C[C@@H]1CCNC1=O)C(=O)COC(=O)Cc1c(C)cccc1F
InChI Key
Data  1 IC50
  Tab Delimited (TSV)   2D SDfile   Computed 3D by Vconf -m prep SDfile
Find this compound or compounds like it in BindingDB:
Activity Spreadsheet -- Enzyme Inhibition Constant Data from BindingDB
Found 1 hit for monomerid = 510044
TargetReplicase polyprotein 1ab(2019-nCoV)
Pfizer
WIPO
LigandPNGBDBM510044((3S)-3-({N-[(4-methoxy-1H-indol-2-yl)carbonyl]-L-l...)
Affinity DataIC50:  8.91nM. Assay description: Proteolytic activity of SARS-CoV-2 Coronavirus 3CL protease is measured using a continuous fluorescence resonance energy transfer assay. The SARS-CoV...
Ligand InfoPC cidPC sid
In DepthDetails PubMed