BDBM510048 (1R,2S,5S)-N-{(1S)-1-Cyano-2-[(3S)-2-oxopyrrolidin-3-yl]ethyl}-6,6-dimethyl-3-[N- (trifluoroacetyl)-L-valyl]-3-azabicyclo[3.1 0]hexane-2-carboxamide (1 )::US11351149, Example 1::WO2021250648, Example 1
SMILES CC(C)[C@H](NC(=O)C(F)(F)F)C(=O)N1C[C@H]2[C@@H]([C@H]1C(=O)N[C@@H](C[C@@H]1CCNC1=O)C#N)C2(C)C
InChI Key InChIKey=QJCAWERZKXLFIJ-QNILMXGZSA-N
Data  1 KI  1 IC50  1 EC50
  Tab Delimited (TSV)   2D SDfile   Computed 3D by Vconf -m prep SDfile
Find this compound or compounds like it in BindingDB:
Activity Spreadsheet -- Enzyme Inhibition Constant Data from BindingDB
Found 3 hits for monomerid = 510048
TargetReplicase polyprotein 1a(2019-nCoV)
Pfizer
US Patent
LigandPNGBDBM510048((1R,2S,5S)-N-{(1S)-1-Cyano-2-[(3S)-2-oxopyrrolidin...)
Affinity DataKi:  13nM. Assay description: The proteolytic activity of the main protease, 3CLpro, of SARS-CoV-2 was monitored using a continuous fluorescence resonance energy transfer (FRET) a...
Ligand InfoPC cidPC sid
In DepthDetails US Patent
TargetReplicase polyprotein 1ab(2019-nCoV)
Pfizer
WIPO
LigandPNGBDBM510048((1R,2S,5S)-N-{(1S)-1-Cyano-2-[(3S)-2-oxopyrrolidin...)
Affinity DataIC50:  13nM. Assay description: The proteolytic activity of the main protease, 3CLpro, of SARS-CoV-2 was monitored using a continuous fluorescence resonance energy transfer (FRET) a...
Ligand InfoPC cidPC sid
In DepthDetails PubMed
TargetReplicase polyprotein 1ab(2019-nCoV)
Pfizer
WIPO
LigandPNGBDBM510048((1R,2S,5S)-N-{(1S)-1-Cyano-2-[(3S)-2-oxopyrrolidin...)
Affinity DataEC50:  246nM. Assay description: The ability of compounds to prevent SARS-CoV-2 coronavirus-induced cell death or cytopathic effect can be assessed via cell viability, using an assay...
Ligand InfoPC cidPC sid
In DepthDetails PubMed