BDBM510073 WO2021250648, Example 25
SMILES CC(C)(C)C[C@H](NC(=O)C1CCCCC1)C(=O)N[C@@H](C[C@@H]1CCNC1=O)C#N
InChI Key InChIKey=WGCBWOLRJCSFSX-ULQDDVLXSA-N
Data  1 EC50
  Tab Delimited (TSV)   2D SDfile   Computed 3D by Vconf -m prep SDfile
Find this compound or compounds like it in BindingDB:
Activity Spreadsheet -- Enzyme Inhibition Constant Data from BindingDB
Found 1 hit for monomerid = 510073
TargetReplicase polyprotein 1ab(2019-nCoV)
Pfizer
WIPO
LigandPNGBDBM510073(WO2021250648, Example 25)
Affinity DataEC50:  3.70E+4nM. Assay description: The ability of compounds to prevent SARS-CoV-2 coronavirus-induced cell death or cytopathic effect can be assessed via cell viability, using an assay...
Ligand InfoPC cidPC sid
In DepthDetails PubMed