BDBM510087 US11351149, Example 39::WO2021250648, Example 39
SMILES COc1ccc(c2[nH]c(C(=O)N[C@@H](CC(C)(C)C)C(=O)N[C@@H](C[C@@H]3CCNC3=O)C#N)c(c12)C(F)(F)F)C(F)(F)F
InChI Key InChIKey=MTXAPYGDANDQKT-YDHLFZDLSA-N
Data  1 KI  1 IC50  1 EC50
  Tab Delimited (TSV)   2D SDfile   Computed 3D by Vconf -m prep SDfile
Find this compound or compounds like it in BindingDB:
Activity Spreadsheet -- Enzyme Inhibition Constant Data from BindingDB
Found 3 hits for monomerid = 510087
TargetReplicase polyprotein 1a(2019-nCoV)
Pfizer
US Patent
LigandPNGBDBM510087(US11351149, Example 39 | WO2021250648, Example 39)
Affinity DataKi:  111nM. Assay description: The proteolytic activity of the main protease, 3CLpro, of SARS-CoV-2 was monitored using a continuous fluorescence resonance energy transfer (FRET) a...
Ligand InfoPC cidPC sid
In DepthDetails US Patent
TargetReplicase polyprotein 1ab(2019-nCoV)
Pfizer
WIPO
LigandPNGBDBM510087(US11351149, Example 39 | WO2021250648, Example 39)
Affinity DataIC50:  111nM. Assay description: The proteolytic activity of the main protease, 3CLpro, of SARS-CoV-2 was monitored using a continuous fluorescence resonance energy transfer (FRET) a...
Ligand InfoPC cidPC sid
In DepthDetails PubMed
TargetReplicase polyprotein 1ab(2019-nCoV)
Pfizer
WIPO
LigandPNGBDBM510087(US11351149, Example 39 | WO2021250648, Example 39)
Affinity DataEC50: >3.33E+3nM. Assay description: The ability of compounds to prevent SARS-CoV-2 coronavirus-induced cell death or cytopathic effect can be assessed via cell viability, using an assay...
Ligand InfoPC cidPC sid
In DepthDetails PubMed