BDBM512417 WO2021219089, INSCoV-110D
SMILES CC(C)(C)c1ccc(cc1)N([C@H](C(=O)NC1CCCCC1)c1cccnc1)C(=O)C=O
InChI Key InChIKey=DQYMBZUVNNQXPT-QHCPKHFHSA-N
Data  1 IC50
  Tab Delimited (TSV)   2D SDfile   Computed 3D by Vconf -m prep SDfile
Find this compound or compounds like it in BindingDB:
Activity Spreadsheet -- Enzyme Inhibition Constant Data from BindingDB
Found 1 hit for monomerid = 512417
TargetReplicase polyprotein 1ab(2019-nCoV)
Insilico Medicine Ip
WIPO
LigandPNGBDBM512417(WO2021219089, INSCoV-110D)
Affinity DataIC50: >5.00E+4nM. Assay description: he C-His6-tagged SARS-CoV-2 M PRO (NC_045512) was cloned, expressed in E. coli and purified by WuXi. The substrate of Dabcyl-KTSAVLQ‖SGFRKME- (...
Ligand InfoKEGGPC cidPC sid
In DepthDetails PubMed