BDBM512430 WO2021219089, INSCoV-501C
SMILES CC(NC(=O)C(N(C(=O)CCl)c1ccc(cc1)-c1cnco1)c1cncnc1)S(=O)(=O)c1ccc(C)cc1
InChI Key InChIKey=ZWBMNEZNAQXSFL-UHFFFAOYSA-N
Data  1 IC50
  Tab Delimited (TSV)   2D SDfile   Computed 3D by Vconf -m prep SDfile
Find this compound or compounds like it in BindingDB:
Activity Spreadsheet -- Enzyme Inhibition Constant Data from BindingDB
Found 1 hit for monomerid = 512430
TargetReplicase polyprotein 1ab(2019-nCoV)
Insilico Medicine Ip
WIPO
LigandPNGBDBM512430(WO2021219089, INSCoV-501C)
Affinity DataIC50:  9.82E+3nM. Assay description: he C-His6-tagged SARS-CoV-2 M PRO (NC_045512) was cloned, expressed in E. coli and purified by WuXi. The substrate of Dabcyl-KTSAVLQ‖SGFRKME- (...
Ligand InfoPC cidPC sid
In DepthDetails PubMed