BDBM512524 acs.jmedchem.1c00409_ST.117
SMILES CC(C)C[C@@H](NC(=O)[C@H](NC(=O)COc1cccc(c1)N(C)C)C(C)C)C(=O)N[C@H](C[C@H]1CCNC1=O)C(=O)c1ncc(s1)-c1ccccc1
InChI Key InChIKey=SAUDUBFZQXQOPS-FANUBLADSA-N
Data  1 KI
  Tab Delimited (TSV)   2D SDfile   Computed 3D by Vconf -m prep SDfile
Find this compound or compounds like it in BindingDB:
Activity Spreadsheet -- Enzyme Inhibition Constant Data from BindingDB
Found 1 hit for monomerid = 512524
TargetReplicase polyprotein 1ab(Human SARS coronavirus (SARS-CoV) (Severe acute re...)
Michigan State University
LigandPNGBDBM512524(acs.jmedchem.1c00409_ST.117)
Affinity DataKi:  170nM. Assay description: This is a review article. Please point to the original journal.
Ligand InfoPC cidPC sid
In DepthDetails ArticlePubMed