BDBM512553 WO2021219089, INSCoV-508
SMILES COc1cccc(c1)N(C(C(=O)NC1CCCCC1)c1cccnc1)C(=O)CCl
InChI Key InChIKey=IHAVFAVFSLAPKF-UHFFFAOYSA-N
Data  1 IC50
  Tab Delimited (TSV)   2D SDfile   Computed 3D by Vconf -m prep SDfile
Find this compound or compounds like it in BindingDB:
Activity Spreadsheet -- Enzyme Inhibition Constant Data from BindingDB
Found 1 hit for monomerid = 512553
TargetReplicase polyprotein 1ab(2019-nCoV)
Insilico Medicine Ip
WIPO
LigandPNGBDBM512553(WO2021219089, INSCoV-508)
Affinity DataIC50: >2.50E+4nM. Assay description: he C-His6-tagged SARS-CoV-2 M PRO (NC_045512) was cloned, expressed in E. coli and purified by WuXi. The substrate of Dabcyl-KTSAVLQ‖SGFRKME- (...
Ligand InfoPC cidPC sid
In DepthDetails PubMed