BDBM512730 WO2021219089, INCoV-600B
SMILES FC1(F)CCC(C1)NC(=O)C(N(C(=O)CCl)c1ccc(cc1)-c1cnco1)c1cncnc1
InChI Key InChIKey=DGSSPBYTNXEMRG-UHFFFAOYSA-N
Data  1 IC50
  Tab Delimited (TSV)   2D SDfile   Computed 3D by Vconf -m prep SDfile
Find this compound or compounds like it in BindingDB:
Activity Spreadsheet -- Enzyme Inhibition Constant Data from BindingDB
Found 1 hit for monomerid = 512730
TargetReplicase polyprotein 1ab(2019-nCoV)
Insilico Medicine Ip
WIPO
LigandPNGBDBM512730(WO2021219089, INCoV-600B)
Affinity DataIC50:  290nM. Assay description: he C-His6-tagged SARS-CoV-2 M PRO (NC_045512) was cloned, expressed in E. coli and purified by WuXi. The substrate of Dabcyl-KTSAVLQ‖SGFRKME- (...
Ligand InfoPC cidPC sid
In DepthDetails PubMed