BDBM512797 WO2021219089, INSCoV-600Q (1)
SMILES Fc1cccc(CCN([C@H](C(=O)NC2CCC(F)(F)CC2)c2cncnc2)C(=O)C2CO2)c1
InChI Key InChIKey=YPUHUQFGJRWOIL-ANYOKISRSA-N
Data  1 IC50
  Tab Delimited (TSV)   2D SDfile   Computed 3D by Vconf -m prep SDfile
Find this compound or compounds like it in BindingDB:
Activity Spreadsheet -- Enzyme Inhibition Constant Data from BindingDB
Found 1 hit for monomerid = 512797
TargetReplicase polyprotein 1ab(2019-nCoV)
Insilico Medicine Ip
WIPO
LigandPNGBDBM512797(WO2021219089, INSCoV-600Q (1))
Affinity DataIC50:  2.26E+4nM. Assay description: he C-His6-tagged SARS-CoV-2 M PRO (NC_045512) was cloned, expressed in E. coli and purified by WuXi. The substrate of Dabcyl-KTSAVLQ‖SGFRKME- (...
Ligand InfoPC cidPC sid
In DepthDetails PubMed