BDBM512812 WO2021219089, INSCoV-600Y
SMILES FC1(F)CCC(CC1)NC(=O)C(N(C(=O)C1CO1)c1ccc(cc1)-c1ccno1)c1cncnc1
InChI Key InChIKey=ISUVPQIQXAQEMV-UHFFFAOYSA-N
Data  1 IC50
  Tab Delimited (TSV)   2D SDfile   Computed 3D by Vconf -m prep SDfile
Find this compound or compounds like it in BindingDB:
Activity Spreadsheet -- Enzyme Inhibition Constant Data from BindingDB
Found 1 hit for monomerid = 512812
TargetReplicase polyprotein 1ab(2019-nCoV)
Insilico Medicine Ip
WIPO
LigandPNGBDBM512812(WO2021219089, INSCoV-600Y)
Affinity DataIC50:  1.99E+3nM. Assay description: he C-His6-tagged SARS-CoV-2 M PRO (NC_045512) was cloned, expressed in E. coli and purified by WuXi. The substrate of Dabcyl-KTSAVLQ‖SGFRKME- (...
Ligand InfoPC cidPC sid
In DepthDetails PubMed