BDBM51282 1-[[(E)-[5-[(carbamothioylhydrazinylidene)methyl]-3-methyl-6-oxidanylidene-cyclohexa-2,4-dien-1-ylidene]methyl]amino]thiourea::MLS000777716::SMR000414158::[[(5E)-6-keto-3-methyl-5-[(N'-thiocarbamoylhydrazino)methylene]cyclohexa-1,3-dien-1-yl]methyleneamino]thiourea::[[(E)-[5-[(carbamothioylhydrazinylidene)methyl]-3-methyl-6-oxo-1-cyclohexa-2,4-dienylidene]methyl]amino]thiourea::[[(E)-[5-[(carbamothioylhydrazinylidene)methyl]-3-methyl-6-oxocyclohexa-2,4-dien-1-ylidene]methyl]amino]thiourea::cid_16682694
SMILES Cc1cc(C=NNC(N)=S)c(O)c(C=NNC(N)=S)c1
InChI Key InChIKey=OLUYNXKJNKHQEW-UHFFFAOYSA-N
Data  1 IC50
  Tab Delimited (TSV)   2D SDfile   Computed 3D by Vconf -m prep SDfile
Find this compound or compounds like it in BindingDB:
Activity Spreadsheet -- Enzyme Inhibition Constant Data from BindingDB
Found 1 hit for monomerid = 51282
TargetGlycoprotein 42(Human herpesvirus 4 type 2)
Emory University
Curated by PubChem BioAssay
LigandPNGBDBM51282(1-[[(E)-[5-[(carbamothioylhydrazinylidene)methyl]-...)
Affinity DataIC50:  1.53E+3nM. Assay description: NIH Molecular Libraries Screening Centers Network [MLSCN] Emory Chemical Biology Discovery Center in MLSCN Assay provider: Theodore Jardetzky; Northw...
In DepthDetails PCBioAssay