BDBM512839 WO2021219089, INSCoV-601K
SMILES FC1(F)CCC(CC1)NC(=O)C(N(C(=O)CCl)c1ccc(cc1)-c1ccns1)c1cncnc1
InChI Key InChIKey=HOLDEJKTYVPWBJ-UHFFFAOYSA-N
Data  1 IC50
  Tab Delimited (TSV)   2D SDfile   Computed 3D by Vconf -m prep SDfile
Find this compound or compounds like it in BindingDB:
Activity Spreadsheet -- Enzyme Inhibition Constant Data from BindingDB
Found 1 hit for monomerid = 512839
TargetReplicase polyprotein 1ab(2019-nCoV)
Insilico Medicine Ip
WIPO
LigandPNGBDBM512839(WO2021219089, INSCoV-601K)
Affinity DataIC50:  100nM. Assay description: he C-His6-tagged SARS-CoV-2 M PRO (NC_045512) was cloned, expressed in E. coli and purified by WuXi. The substrate of Dabcyl-KTSAVLQ‖SGFRKME- (...
Ligand InfoPC cidPC sid
In DepthDetails PubMed