BDBM512899 WO2021219089, INSCoV-614 (1A)
SMILES F[C@H](Cl)C(=O)N([C@H](C(=O)NC1CCC(F)(F)CC1)c1cncnc1)c1ccc(cc1)-c1cncs1
InChI Key InChIKey=YLWLWAOTMHHXDQ-PMACEKPBSA-N
Data  1 IC50
  Tab Delimited (TSV)   2D SDfile   Computed 3D by Vconf -m prep SDfile
Find this compound or compounds like it in BindingDB:
Activity Spreadsheet -- Enzyme Inhibition Constant Data from BindingDB
Found 1 hit for monomerid = 512899
TargetReplicase polyprotein 1ab(2019-nCoV)
Insilico Medicine Ip
WIPO
LigandPNGBDBM512899(WO2021219089, INSCoV-614 (1A))
Affinity DataIC50: >2.50E+4nM. Assay description: he C-His6-tagged SARS-CoV-2 M PRO (NC_045512) was cloned, expressed in E. coli and purified by WuXi. The substrate of Dabcyl-KTSAVLQ‖SGFRKME- (...
Ligand InfoPC cidPC sid
In DepthDetails PubMed